无法使用gradle构建android项目

jon*_*ney 4 android build gradle

我在使用Gradle构建一个简单的android项目时遇到了麻烦.我的构建文件如下:

buildscript {
    repositories {
      mavenCentral()
      // To use a development snapshot version of the plugin, add the
      // Sonatype Snapshots repository.
      maven {
        url "https://oss.sonatype.org/content/repositories/snapshots"
      }
    }

    dependencies {
      classpath 'org.gradle.api.plugins:gradle-android-plugin:1.2.1'
    }
  }

  apply plugin: 'android'

  repositories {
      mavenCentral()
  }

  // Sets the package version
  version = "1.0.0"



  // Signing configuration, valid for all builds (1)
  androidSignAndAlign {
    keyStore = "path/to/my/keystore"
    keyAlias = "my-key-alias"
    keyStorePassword = "mystorepass"
    keyAliasPassword = "myaliaspass"
  }

  // Configure the filtering of resources with properties from the Gradle's project scope (2)
  processResources {
    expand (project.properties)
  }

  // Configure a dedicated debug build (3)
  task configureDebug << {
    jar.classifier = "debug"
  }

  // Configure a dedicated release build (4)
  task configureRelease << {
    proguard.enabled = true
  }
Run Code Online (Sandbox Code Playgroud)

我得到的错误是这样的:

  11:08:24.812 [ERROR] [org.gradle.BuildExceptionReporter] FAILURE: Build failed with an exception.
11:08:24.822 [ERROR] [org.gradle.BuildExceptionReporter]
11:08:24.829 [ERROR] [org.gradle.BuildExceptionReporter] * Where:
11:08:24.834 [ERROR] [org.gradle.BuildExceptionReporter] Build file 'C:\Users\Work\AndroidProjects\RssUnified\build.gradle' line: 114
11:08:24.840 [ERROR] [org.gradle.BuildExceptionReporter]
11:08:24.845 [ERROR] [org.gradle.BuildExceptionReporter] * What went wrong:
11:08:24.850 [ERROR] [org.gradle.BuildExceptionReporter] A problem occurred evaluating root project 'RssUnified'.
11:08:24.855 [ERROR] [org.gradle.BuildExceptionReporter] > For input string: "21 rc11"
11:08:24.864 [ERROR] [org.gradle.BuildExceptionReporter]
11:08:24.870 [ERROR] [org.gradle.BuildExceptionReporter] * Exception is:
11:08:24.875 [ERROR] [org.gradle.BuildExceptionReporter] org.gradle.api.GradleScriptException: A problem occurred evaluating root project 'RssUnified'.
11:08:24.880 [ERROR] [org.gradle.BuildExceptionReporter]        at org.gradle.groovy.scripts.internal.DefaultScriptRunnerFactory$ScriptRunnerImpl.run(DefaultScriptRunnerFac
tory.java:54)
11:08:24.885 [ERROR] [org.gradle.BuildExceptionReporter]        at org.gradle.configuration.DefaultScriptPluginFactory$ScriptPluginImpl.apply(DefaultScriptPluginFactory.jav
a:127)
Run Code Online (Sandbox Code Playgroud)

使用gradle 1.2

编辑:这是我的布局xml文件

<?xml version="1.0" encoding="utf-8"?>
<RelativeLayout xmlns:android="http://schemas.android.com/apk/res/android"
    android:layout_width="fill_parent"
    android:layout_height="fill_parent" >

</RelativeLayout>
Run Code Online (Sandbox Code Playgroud)

这就是积极性

public class RssListActivity extends Activity {

    /*
     * (non-Javadoc)
     * @see android.app.Activity#onCreate(android.os.Bundle)
     */
    @Override
    protected void onCreate(Bundle savedInstanceState) {
        // TODO Auto-generated method stub
        super.onCreate(savedInstanceState);
        setContentView(R.layout.list_activity_layout);
    }

}
Run Code Online (Sandbox Code Playgroud)

项目结构如下:

????.gradle
?   ????1.2
?       ????taskArtifacts
????assets
????bin
?   ????classes
?   ?   ????com
?   ?       ????jr
?   ?       ?   ????screenLogic
?   ?       ?   ????screens
?   ?       ????richy
?   ?           ????rssunified
?   ????res
????build
?   ????gen
?       ????com
?           ????richy
?               ????rssunified
????gen
?   ????com
?       ????richy
?           ????rssunified
????res
?   ????drawable-hdpi
?   ????drawable-ldpi
?   ????drawable-mdpi
?   ????drawable-xhdpi
?   ????layout
?   ????values
?   ????values-v11
?   ????values-v14
????src
    ????com
        ????jr
            ????screenLogic
            ????screens
Run Code Online (Sandbox Code Playgroud)

这是项目的根文件夹中的内容

AndroidManifest.xml  assets  bin  build  build.gradle  gen  gradle.properties  ic_launcher-web.png  local.properties  project.properties  res  src
Run Code Online (Sandbox Code Playgroud)

最终的android清单:

<?xml version="1.0" encoding="utf-8"?>
<manifest xmlns:android="http://schemas.android.com/apk/res/android"
    package="com.richy.rssunified"
    android:versionCode="1"
    android:versionName="1.0">

    <uses-sdk android:minSdkVersion="8" android:targetSdkVersion="15" />

    <application android:label="@string/app_name"
        android:icon="@drawable/ic_launcher"
        android:theme="@style/AppTheme">

    </application>

</manifest>
Run Code Online (Sandbox Code Playgroud)

Local.properties

sdk.dir = C:/Program Files (x86)/Android/android-sdk
Run Code Online (Sandbox Code Playgroud)

project.properties

# This file is automatically generated by Android Tools.
# Do not modify this file -- YOUR CHANGES WILL BE ERASED!
#
# This file must be checked in Version Control Systems.
#
# To customize properties used by the Ant build system edit
# "ant.properties", and override values to adapt the script to your
# project structure.
#
# To enable ProGuard to shrink and obfuscate your code, uncomment this (available properties: sdk.dir, user.home):
#proguard.config=${sdk.dir}/tools/proguard/proguard-android.txt:proguard-project.txt

# Project target.
target=android-15
Run Code Online (Sandbox Code Playgroud)

编辑:

我已经恢复到旧版本的adt/sdk插件并设法解决上述问题,但是在我这样做之后,我现在得到以下错误:

15:24:24.558 [LIFECYCLE] [org.gradle.TaskExecutionLogger] :androidProcessResources FAILED
15:24:24.571 [ERROR] [org.gradle.BuildExceptionReporter]
15:24:24.575 [ERROR] [org.gradle.BuildExceptionReporter] FAILURE: Build failed with an exception.
15:24:24.582 [ERROR] [org.gradle.BuildExceptionReporter]
15:24:24.588 [ERROR] [org.gradle.BuildExceptionReporter] * What went wrong:
15:24:24.597 [ERROR] [org.gradle.BuildExceptionReporter] Execution failed for task ':androidProcessResources'.
15:24:24.602 [ERROR] [org.gradle.BuildExceptionReporter] > Unexpected internal error near index 1
15:24:24.607 [ERROR] [org.gradle.BuildExceptionReporter]   \
15:24:24.613 [ERROR] [org.gradle.BuildExceptionReporter]    ^
15:24:24.621 [ERROR] [org.gradle.BuildExceptionReporter]
15:24:24.626 [ERROR] [org.gradle.BuildExceptionReporter] * Exception is:
15:24:24.631 [ERROR] [org.gradle.BuildExceptionReporter] org.gradle.api.tasks.TaskExecutionException: Execution failed for task ':androidProcessResources'.
15:24:24.636 [ERROR] [org.gradle.BuildExceptionReporter]        at org.gradle.api.internal.tasks.execution.ExecuteActionsTaskExecuter.executeActions(ExecuteActionsTaskExecu
ter.java:68)
Run Code Online (Sandbox Code Playgroud)

paw*_*eba 5

如下所述:http:
//tools.android.com/tech-docs/new-build-system/using-the-new-build-system#TOC-Working-with-and-Customizing-SourceSets

默认的源集位置在 src/<sourceset>

你的sourceset名字是main如此的位置src/main

此外,manifest描述了财产:

manifest,键入AndroidSourceFile,默认位置 src/<sourceset>/AndroidManifest.xml

我猜清单的声明:

   manifest {
                srcFile 'AndroidManifest.xml'
            }
Run Code Online (Sandbox Code Playgroud)

与默认值相同,最后是位置:

src/main/AndroidManifest.xml
Run Code Online (Sandbox Code Playgroud)

在异常消息中列出.

我认为这是gradle android插件的工作原理.
如果我错了,请纠正我,我不知道Gradle.

编辑

好的,现在我知道出了什么问题.您的构建脚本混合了两个不同插件的设置.

更改:

classpath 'com.android.tools.build:gradle:0.1'
Run Code Online (Sandbox Code Playgroud)

classpath 'org.gradle.api.plugins:gradle-android-plugin:1.2.1'
Run Code Online (Sandbox Code Playgroud)

移除android块,但保持身体.

sourceSets用身体去除块.

然后它应该工作,我这次测试它.

编辑2

这是Windows相关的错误,修复6天前:

https://github.com/jvoegele/gradle-android-plugin/pull/89

你可以做的是下载最新的插件版本

git clone git://github.com/jvoegele/gradle-android-plugin.git
Run Code Online (Sandbox Code Playgroud)

并将其安装在本地maven存储库中:

gradle install
Run Code Online (Sandbox Code Playgroud)

然后添加mavenLocal()到存储库:

repositories {
    mavenCentral()
    mavenLocal()
}
Run Code Online (Sandbox Code Playgroud)

并将插件版本更改为快照:

dependencies {
    classpath 'org.gradle.api.plugins:gradle-android-plugin:1.2.2-SNAPSHOT'
}
Run Code Online (Sandbox Code Playgroud)