maven错误BUILD FAILURE

ent*_*ize 5 maven

我正在关注一个maven教程.我正在尝试执行这个命令,这是我的第一个maven命令.教程说它会创建一个名为my-app的目录,但事实并非如此.这是命令及其输出,命令:

mvn archetype:generate -DgroupId=com.mycompany.app -DartifactId=my-app -DarchetypeArtifactId=maven-archetype-quickstart -DinteractiveMode=false
Run Code Online (Sandbox Code Playgroud)

输出:

C:\Users\Babar>mvn archetype:generate -DgroupId=com.mycompany.app -DartifactId=m
y-app -DarchetypeArtifactId=maven-archetype-quickstart -DinteractiveMode=false
[INFO] Scanning for projects...
[INFO]
[INFO] ------------------------------------------------------------------------
[INFO] Building Maven Stub Project (No POM) 1
[INFO] ------------------------------------------------------------------------
[INFO]
[INFO] >>> maven-archetype-plugin:2.1:generate (default-cli) @ standalone-pom >>
>
[INFO]
[INFO] <<< maven-archetype-plugin:2.1:generate (default-cli) @ standalone-pom <<
<
[INFO]
[INFO] --- maven-archetype-plugin:2.1:generate (default-cli) @ standalone-pom --
-
[INFO] Generating project in Batch mode
[INFO] -------------------------------------------------------------------------
---
[INFO] Using following parameters for creating project from Old (1.x) Archetype:
 maven-archetype-quickstart:1.0
[INFO] -------------------------------------------------------------------------
---
[INFO] Parameter: groupId, Value: com.mycompany.app
[INFO] Parameter: packageName, Value: com.mycompany.app
[INFO] Parameter: package, Value: com.mycompany.app
[INFO] Parameter: artifactId, Value: my-app
[INFO] Parameter: basedir, Value: C:\Users\Babar
[INFO] Parameter: version, Value: 1.0-SNAPSHOT
[INFO] ------------------------------------------------------------------------
[INFO] BUILD FAILURE
[INFO] ------------------------------------------------------------------------
[INFO] Total time: 22.971s
[INFO] Finished at: Fri Nov 18 00:07:12 EET 2011
[INFO] Final Memory: 6M/11M
[INFO] ------------------------------------------------------------------------
[ERROR] Failed to execute goal org.apache.maven.plugins:maven-archetype-plugin:2
.1:generate (default-cli) on project standalone-pom: Directory my-app already ex
ists - please run from a clean directory -> [Help 1]
[ERROR]
[ERROR] To see the full stack trace of the errors, re-run Maven with the -e swit
ch.
[ERROR] Re-run Maven using the -X switch to enable full debug logging.
[ERROR]
[ERROR] For more information about the errors and possible solutions, please rea
d the following articles:
[ERROR] [Help 1] http://cwiki.apache.org/confluence/display/MAVEN/MojoFailureExc
eption
'cmd' is not recognized as an internal or external command,
operable program or batch file.
Run Code Online (Sandbox Code Playgroud)

错误消息msg说目录已经存在,但事实并非如此.我执行此命令比oncw更多

编辑

命令(建议回答)

mvn archetype:generate -DarchetypeGroupId=org.apache.maven.archet
    ypes -DarchetypeArtifactId=maven-archetype-quickstart -DarchetypeVersion=5-SNAPS
    HOT
Run Code Online (Sandbox Code Playgroud)

OUTPUT

C:\Users\Babar>mvn archetype:generate -DarchetypeGroupId=org.apache.maven.archet
ypes -DarchetypeArtifactId=maven-archetype-quickstart -DarchetypeVersion=5-SNAPS
HOT
[INFO] Scanning for projects...
[INFO]
[INFO] ------------------------------------------------------------------------
[INFO] Building Maven Stub Project (No POM) 1
[INFO] ------------------------------------------------------------------------
[INFO]
[INFO] >>> maven-archetype-plugin:2.1:generate (default-cli) @ standalone-pom >>
>
[INFO]
[INFO] <<< maven-archetype-plugin:2.1:generate (default-cli) @ standalone-pom <<
<
[INFO]
[INFO] --- maven-archetype-plugin:2.1:generate (default-cli) @ standalone-pom --
-
[INFO] Generating project in Interactive mode
[INFO] Archetype repository missing. Using the one from [org.apache.maven.archet
ypes:maven-archetype-quickstart:1.1] found in catalog remote
[INFO] ------------------------------------------------------------------------
[INFO] BUILD FAILURE
[INFO] ------------------------------------------------------------------------
[INFO] Total time: 5.552s
[INFO] Finished at: Fri Nov 18 01:09:15 EET 2011
[INFO] Final Memory: 6M/12M
[INFO] ------------------------------------------------------------------------
[ERROR] Failed to execute goal org.apache.maven.plugins:maven-archetype-plugin:2
.1:generate (default-cli) on project standalone-pom: The desired archetype does
not exist (org.apache.maven.archetypes:maven-archetype-quickstart:5-SNAPSHOT) ->
 [Help 1]
[ERROR]
[ERROR] To see the full stack trace of the errors, re-run Maven with the -e swit
ch.
[ERROR] Re-run Maven using the -X switch to enable full debug logging.
[ERROR]
[ERROR] For more information about the errors and possible solutions, please rea
d the following articles:
[ERROR] [Help 1] http://cwiki.apache.org/confluence/display/MAVEN/MojoFailureExc
eption
'cmd' is not recognized as an internal or external command,
operable program or batch file.
Run Code Online (Sandbox Code Playgroud)

Sri*_*ran 0

你会注意到原来的错误说

目录 my-app 已存在 - 请从干净的目录运行

您是否可能从已经存在 Maven 项目(带有pom.xml文件的项目)的目录运行该命令?如果是这样,请从一个干净的位置开始。

当我在空目录上运行您逐字使用的命令时,它运行时没有错误并创建了一个名为my-app.