这时候我会看很多的YouTube在谷歌的教程和文章后安装Nuxt JS,所以我对我的液滴基于Ubuntu 18.04已经安装节点JS之后,我第一次运行时npm init -y 和npm install nuxt --save 和npx create-nuxt-app project和收到此错误信息:
module.js:549
throw err;
^
Error: Cannot find module '/root/.npm/_npx/1934/lib/node_modules/create-nuxt-app/node_modules/ejs/postinstall.js'
at Function.Module._resolveFilename (module.js:547:15)
at Function.Module._load (module.js:474:25)
at Function.Module.runMain (module.js:693:10)
at startup (bootstrap_node.js:188:16)
at bootstrap_node.js:609:3
npm ERR! code ELIFECYCLE
npm ERR! errno 1
npm ERR! ejs@2.7.4 postinstall: `node ./postinstall.js`
npm ERR! Exit status 1
npm ERR!
npm ERR! Failed at the ejs@2.7.4 postinstall script.
npm ERR! This is probably not a problem with npm. There is likely additional logging output above.
npm ERR! A complete log of this run can be found in:
npm ERR! /root/.npm/_logs/2019-11-28T16_17_41_163Z-debug.log
Install for create-nuxt-app@latest failed with code 1
Run Code Online (Sandbox Code Playgroud)
我找到了解决方案
npm i -g create-nuxt-app
npx create-nuxt-app nuxt002
npm run dev
Run Code Online (Sandbox Code Playgroud)
参考:https : //github.com/nuxt-community/starter-template/issues/48
| 归档时间: |
|
| 查看次数: |
6186 次 |
| 最近记录: |