sbr*_*rm1 6 c c++ gcc compiler-errors
我正在尝试gcc-4.8.3按照这个为 LFS编译。
使用时make,出现以下错误:
checking dynamic linker characteristics... configure: error: Link tests are not allowed after GCC_NO_EXECUTABLES.
make[1]: *** [configure-target-libstdc++-v3] Error 1
make[1]: Leaving directory `/mnt/c/Users/admin/Desktop/Projects/AssaultArchitecture/sources/gcc-4.8.3/build'
make: *** [all] Error 2
Run Code Online (Sandbox Code Playgroud)
配置选项:
../configure \
--target=$LFS_TGT \
--prefix=/tools \
--with-glibc-version=2.11 \
--with-sysroot=$LFS \
--with-newlib \
--without-headers \
--with-local-prefix=/tools \
--with-native-system-header-dir=/tools/include \
--disable-nls \
--disable-shared \
--disable-multilib \
--disable-decimal-float \
--disable-threads \
--disable-libatomic \
--disable-libgomp \
--disable-libmpx \
--disable-libquadmath \
--disable-libssp \
--disable-libvtv \
--disable-libstdcxx \
--enable-languages=c,c++
Run Code Online (Sandbox Code Playgroud)
哪里$LFS_TGT是x86_64-lfs-linux-gnu。
config.log在PasteBin 上。
最后几行输出:
checking if /mnt/c/Users/admin/Desktop/Projects/AssaultArchitecture/sources/gcc-4.8.3/build/./gcc/xgcc -B/mnt/c/Users/admin/Desktop/Projects/AssaultArchitecture/sources/gcc-4.8.3/build/./gcc/ -B/tools/x86_64-lfs-linux-gnu/bin/ -B/tools/x86_64-lfs-linux-gnu/lib/ -isystem /tools/x86_64-lfs-linux-gnu/include -isystem /tools/x86_64-lfs-linux-gnu/sys-include supports -fno-rtti -fno-exceptions... no
checking for /mnt/c/Users/admin/Desktop/Projects/AssaultArchitecture/sources/gcc-4.8.3/build/./gcc/xgcc -B/mnt/c/Users/admin/Desktop/Projects/AssaultArchitecture/sources/gcc-4.8.3/build/./gcc/ -B/tools/x86_64-lfs-linux-gnu/bin/ -B/tools/x86_64-lfs-linux-gnu/lib/ -isystem /tools/x86_64-lfs-linux-gnu/include -isystem /tools/x86_64-lfs-linux-gnu/sys-include option to produce PIC... -fPIC -DPIC
checking if /mnt/c/Users/admin/Desktop/Projects/AssaultArchitecture/sources/gcc-4.8.3/build/./gcc/xgcc -B/mnt/c/Users/admin/Desktop/Projects/AssaultArchitecture/sources/gcc-4.8.3/build/./gcc/ -B/tools/x86_64-lfs-linux-gnu/bin/ -B/tools/x86_64-lfs-linux-gnu/lib/ -isystem /tools/x86_64-lfs-linux-gnu/include -isystem /tools/x86_64-lfs-linux-gnu/sys-include PIC flag -fPIC -DPIC works... yes
checking if /mnt/c/Users/admin/Desktop/Projects/AssaultArchitecture/sources/gcc-4.8.3/build/./gcc/xgcc -B/mnt/c/Users/admin/Desktop/Projects/AssaultArchitecture/sources/gcc-4.8.3/build/./gcc/ -B/tools/x86_64-lfs-linux-gnu/bin/ -B/tools/x86_64-lfs-linux-gnu/lib/ -isystem /tools/x86_64-lfs-linux-gnu/include -isystem /tools/x86_64-lfs-linux-gnu/sys-include static flag -static works... no
checking if /mnt/c/Users/admin/Desktop/Projects/AssaultArchitecture/sources/gcc-4.8.3/build/./gcc/xgcc -B/mnt/c/Users/admin/Desktop/Projects/AssaultArchitecture/sources/gcc-4.8.3/build/./gcc/ -B/tools/x86_64-lfs-linux-gnu/bin/ -B/tools/x86_64-lfs-linux-gnu/lib/ -isystem /tools/x86_64-lfs-linux-gnu/include -isystem /tools/x86_64-lfs-linux-gnu/sys-include supports -c -o file.o... yes
checking if /mnt/c/Users/admin/Desktop/Projects/AssaultArchitecture/sources/gcc-4.8.3/build/./gcc/xgcc -B/mnt/c/Users/admin/Desktop/Projects/AssaultArchitecture/sources/gcc-4.8.3/build/./gcc/ -B/tools/x86_64-lfs-linux-gnu/bin/ -B/tools/x86_64-lfs-linux-gnu/lib/ -isystem /tools/x86_64-lfs-linux-gnu/include -isystem /tools/x86_64-lfs-linux-gnu/sys-include supports -c -o file.o... (cached) yes
checking whether the /mnt/c/Users/admin/Desktop/Projects/AssaultArchitecture/sources/gcc-4.8.3/build/./gcc/xgcc -B/mnt/c/Users/admin/Desktop/Projects/AssaultArchitecture/sources/gcc-4.8.3/build/./gcc/ -B/tools/x86_64-lfs-linux-gnu/bin/ -B/tools/x86_64-lfs-linux-gnu/lib/ -isystem /tools/x86_64-lfs-linux-gnu/include -isystem /tools/x86_64-lfs-linux-gnu/sys-include linker (/mnt/c/Users/admin/Desktop/Projects/AssaultArchitecture/sources/gcc-4.8.3/build/./gcc/collect-ld -m elf_x86_64) supports shared libraries... yes
checking dynamic linker characteristics... configure: error: Link tests are not allowed after GCC_NO_EXECUTABLES.
make[1]: *** [configure-target-libstdc++-v3] Error 1
make[1]: Leaving directory `/mnt/c/Users/admin/Desktop/Projects/AssaultArchitecture/sources/gcc-4.8.3/build'
make: *** [all] Error 2
Run Code Online (Sandbox Code Playgroud)
小智 6
如果您在x86_64机器上构建它并且您将其x86_64作为目标,那么您实际上并没有构建交叉编译器。
您似乎正在构建一个独立的 stage1 编译器,因此您必须添加--disable-bootstrap标志。如果您的构建目标平台不是本机平台(交叉编译器),则 GCC 默认禁用引导程序。