Ale*_*lls 2 java bash shell maven jenkins
作为 Jenkins 构建的一部分,Jenkins 使用 Maven,而 Maven 又使用项目根目录下的 pom.xml 文件。现在这几乎是一个无操作:
<project>
<modelVersion>4.0.0</modelVersion>
<groupId>com.dqsalpha-dev.app</groupId>
<artifactId>dqsalpha</artifactId>
<version>1</version>
</project>
Run Code Online (Sandbox Code Playgroud)
我想在这个 pom 文件中添加一件事 - 我想在maven build运行时运行一个测试(它只是一个 shell 脚本)。
通过 pom 文件向 Maven 构建添加测试的最简单方法是什么?
像这样的东西:
<project>
<modelVersion>4.0.0</modelVersion>
<groupId>com.dqsalpha-dev.app</groupId>
<artifactId>dqsalpha</artifactId>
<version>1</version>
<test>
<bash>
@test.sh
</bash>
</test>
</project>
Run Code Online (Sandbox Code Playgroud)
但这是完全不正确的。我刚刚意识到我可能还需要使用 npm install 安装 Node.js 依赖项。
我试过这个:
https://bitbucket.org/atlassian/bash-maven-plugin
然后我的 pom.xml 看起来像:
<project>
<modelVersion>4.0.0</modelVersion>
<groupId>com.dqsalpha-dev.app</groupId>
<artifactId>dqsalpha</artifactId>
<version>1</version>
<build>
<plugins>
<plugin>
<groupId>com.atlassian.maven.plugins</groupId>
<artifactId>bash-maven-plugin</artifactId>
<version>1.0-SNAPSHOT</version>
<executions>
<execution>
<id>test</id>
<phase>integration-test</phase>
<goals>
<goal>run</goal>
</goals>
</execution>
</executions>
<configuration>
<script>
npm install;
./test.sh
</script>
</configuration>
</plugin>
</plugins>
</build>
<properties>
<example.one>Variable replacement is available from Maven.</example.one>
</properties>
<dependencies>
<dependency>
<groupId>com.atlassian.maven.plugins</groupId>
<artifactId>bash-maven-plugin</artifactId>
<version>1.0-SNAPSHOT</version>
<scope>provided</scope>
</dependency>
</dependencies>
</project>
Run Code Online (Sandbox Code Playgroud)
但后来我得到这个错误:
$ mvn clean install
[INFO] Scanning for projects...
[INFO]
[INFO] ------------------------------------------------------------------------
[INFO] Building dqsalpha 1
[INFO] ------------------------------------------------------------------------
[WARNING] The POM for com.atlassian.maven.plugins:bash-maven-plugin:jar:1.0-SNAPSHOT is missing, no dependency information available
[INFO] ------------------------------------------------------------------------
[INFO] BUILD FAILURE
[INFO] ------------------------------------------------------------------------
[INFO] Total time: 0.187 s
[INFO] Finished at: 2017-04-11T16:09:24-07:00
[INFO] Final Memory: 8M/309M
[INFO] ------------------------------------------------------------------------
[ERROR] Plugin com.atlassian.maven.plugins:bash-maven-plugin:1.0-SNAPSHOT or one of its dependencies could not be resolved: Could not find artifact com.atlassian.maven.plugins:bash-maven-plugin:jar:1.0-SNAPSHOT -> [Help 1]
[ERROR]
[ERROR] To see the full stack trace of the errors, re-run Maven with the -e switch.
[ERROR] Re-run Maven using the -X switch to enable full debug logging.
[ERROR]
[ERROR] For more information about the errors and possible solutions, please read the following articles:
[ERROR] [Help 1] http://cwiki.apache.org/confluence/display/MAVEN/PluginResolutionException
Run Code Online (Sandbox Code Playgroud)
您可以使用exec-maven-plugin:
<plugin>
<artifactId>exec-maven-plugin</artifactId>
<groupId>org.codehaus.mojo</groupId>
<executions>
<execution>
<id>test1</id>
<phase>package</phase>
<goals>
<goal>exec</goal>
</goals>
<configuration>
<executable>${basedir}/test.sh</executable>
</configuration>
</execution>
</executions>
</plugin>
Run Code Online (Sandbox Code Playgroud)
| 归档时间: |
|
| 查看次数: |
12923 次 |
| 最近记录: |