man*_*her 13 java maven lombok
我正在尝试编译我的项目,通过maven使用lombok,我得到以下问题:
[INFO] ------------------------------------------------------------------------
[INFO] Building akka-calculator-lib 1.0-SNAPSHOT
[INFO] ------------------------------------------------------------------------
[INFO]
[INFO] --- maven-clean-plugin:2.5:clean (default-clean) @ akka-calculator-lib ---
[INFO] Deleting C:\dev\projects\Akka\akka-testing\akka-calculator\akka-calculator-lib\target
[INFO]
[INFO] --- maven-resources-plugin:2.6:resources (default-resources) @ akka-calculator-lib ---
[WARNING] Using platform encoding (Cp1252 actually) to copy filtered resources, i.e. build is platform dependent!
[INFO] Copying 2 resources
[INFO]
[INFO] --- maven-compiler-plugin:2.3.2:compile (default-compile) @ akka-calculator-lib ---
[WARNING] File encoding has not been set, using platform encoding Cp1252, i.e. build is platform dependent!
[INFO] Compiling 11 source files to C:\dev\projects\Akka\akka-testing\akka-calculator\akka-calculator-lib\target\classes
[INFO] -------------------------------------------------------------
[ERROR] COMPILATION ERROR :
[INFO] -------------------------------------------------------------
[ERROR] \dev\projects\Akka\akka-testing\akka-calculator\akka-calculator-lib\src\main\java\com\mangusbrother\akka\calculator\lib\operation\multiply\MultiplyResult.java:[13,22] error: variable firstNumber not initialized in the default constructor
[ERROR] \dev\projects\Akka\akka-testing\akka-calculator\akka-calculator-lib\src\main\java\com\mangusbrother\akka\calculator\lib\operation\multiply\MultiplyResult.java:[14,22] error: variable secondNumber not initialized in the default constructor
[ERROR] \dev\projects\Akka\akka-testing\akka-calculator\akka-calculator-lib\src\main\java\com\mangusbrother\akka\calculator\lib\operation\multiply\MultiplyResult.java:[15,22] error: variable result not initialized in the default constructor
[ERROR] \dev\projects\Akka\akka-testing\akka-calculator\akka-calculator-lib\src\main\java\com\mangusbrother\akka\calculator\lib\CalculatorActor.java:[35,52] error: cannot find symbol
[ERROR] \dev\projects\Akka\akka-testing\akka-calculator\akka-calculator-lib\src\main\java\com\mangusbrother\akka\calculator\lib\CalculatorActor.java:[35,87] error: cannot find symbol
[ERROR] \dev\projects\Akka\akka-testing\akka-calculator\akka-calculator-lib\src\main\java\com\mangusbrother\akka\calculator\lib\CalculatorActor.java:[36,54] error: cannot find symbol
[ERROR] \dev\projects\Akka\akka-testing\akka-calculator\akka-calculator-lib\src\main\java\com\mangusbrother\akka\calculator\lib\CalculatorActor.java:[37,74] error: cannot find symbol
[ERROR] \dev\projects\Akka\akka-testing\akka-calculator\akka-calculator-lib\src\main\java\com\mangusbrother\akka\calculator\lib\CalculatorActor.java:[38,74] error: cannot find symbol
[ERROR] \dev\projects\Akka\akka-testing\akka-calculator\akka-calculator-lib\src\main\java\com\mangusbrother\akka\calculator\lib\CalculatorActor.java:[38,101] error: cannot find symbol
[ERROR] \dev\projects\Akka\akka-testing\akka-calculator\akka-calculator-lib\src\main\java\com\mangusbrother\akka\calculator\lib\CalculatorActor.java:[43,50] error: cannot find symbol
[ERROR] \dev\projects\Akka\akka-testing\akka-calculator\akka-calculator-lib\src\main\java\com\mangusbrother\akka\calculator\lib\CalculatorActor.java:[43,85] error: cannot find symbol
[ERROR] \dev\projects\Akka\akka-testing\akka-calculator\akka-calculator-lib\src\main\java\com\mangusbrother\akka\calculator\lib\CalculatorActor.java:[44,64] error: cannot find symbol
[ERROR] \dev\projects\Akka\akka-testing\akka-calculator\akka-calculator-lib\src\main\java\com\mangusbrother\akka\calculator\lib\CalculatorActor.java:[45,84] error: cannot find symbol
[ERROR] \dev\projects\Akka\akka-testing\akka-calculator\akka-calculator-lib\src\main\java\com\mangusbrother\akka\calculator\lib\CalculatorActor.java:[46,84] error: cannot find symbol
[ERROR] \dev\projects\Akka\akka-testing\akka-calculator\akka-calculator-lib\src\main\java\com\mangusbrother\akka\calculator\lib\CalculatorActor.java:[46,111] error: cannot find symbol
[ERROR] \dev\projects\Akka\akka-testing\akka-calculator\akka-calculator-lib\src\main\java\com\mangusbrother\akka\calculator\lib\CalculatorActor.java:[51,50] error: cannot find symbol
[ERROR] \dev\projects\Akka\akka-testing\akka-calculator\akka-calculator-lib\src\main\java\com\mangusbrother\akka\calculator\lib\CalculatorActor.java:[51,85] error: cannot find symbol
[ERROR] \dev\projects\Akka\akka-testing\akka-calculator\akka-calculator-lib\src\main\java\com\mangusbrother\akka\calculator\lib\CalculatorActor.java:[52,64] error: cannot find symbol
[ERROR] \dev\projects\Akka\akka-testing\akka-calculator\akka-calculator-lib\src\main\java\com\mangusbrother\akka\calculator\lib\CalculatorActor.java:[53,84] error: cannot find symbol
[ERROR] \dev\projects\Akka\akka-testing\akka-calculator\akka-calculator-lib\src\main\java\com\mangusbrother\akka\calculator\lib\CalculatorActor.java:[54,84] error: cannot find symbol
[ERROR] \dev\projects\Akka\akka-testing\akka-calculator\akka-calculator-lib\src\main\java\com\mangusbrother\akka\calculator\lib\CalculatorActor.java:[54,111] error: cannot find symbol
[ERROR] \dev\projects\Akka\akka-testing\akka-calculator\akka-calculator-lib\src\main\java\com\mangusbrother\akka\calculator\lib\CalculatorActor.java:[59,50] error: cannot find symbol
[ERROR] \dev\projects\Akka\akka-testing\akka-calculator\akka-calculator-lib\src\main\java\com\mangusbrother\akka\calculator\lib\CalculatorActor.java:[59,85] error: cannot find symbol
[ERROR] \dev\projects\Akka\akka-testing\akka-calculator\akka-calculator-lib\src\main\java\com\mangusbrother\akka\calculator\lib\CalculatorActor.java:[60,60] error: cannot find symbol
[ERROR] \dev\projects\Akka\akka-testing\akka-calculator\akka-calculator-lib\src\main\java\com\mangusbrother\akka\calculator\lib\CalculatorActor.java:[61,80] error: cannot find symbol
[ERROR] \dev\projects\Akka\akka-testing\akka-calculator\akka-calculator-lib\src\main\java\com\mangusbrother\akka\calculator\lib\CalculatorActor.java:[62,89] error: cannot find symbol
[ERROR] \dev\projects\Akka\akka-testing\akka-calculator\akka-calculator-lib\src\main\java\com\mangusbrother\akka\calculator\lib\CalculatorActor.java:[62,127] error: cannot find symbol
[INFO] 27 errors
[INFO] -------------------------------------------------------------
[INFO] ------------------------------------------------------------------------
[INFO] Reactor Summary:
[INFO]
[INFO] akka-parent ........................................ SUCCESS [ 0.164 s]
[INFO] akka-testing ....................................... SUCCESS [ 0.011 s]
[INFO] akka-calculator .................................... SUCCESS [ 0.010 s]
[INFO] akka-calculator-lib ................................ FAILURE [ 2.758 s]
[INFO] akka-calculator-creation ........................... SKIPPED
[INFO] akka-calculator-lookup ............................. SKIPPED
[INFO] ------------------------------------------------------------------------
[INFO] BUILD FAILURE
[INFO] ------------------------------------------------------------------------
[INFO] Total time: 3.120 s
[INFO] Finished at: 2016-02-14T19:01:21+01:00
[INFO] Final Memory: 14M/169M
[INFO] ------------------------------------------------------------------------
Run Code Online (Sandbox Code Playgroud)
第一个错误类型适用于此类中的字段:
package com.mangusbrother.akka.calculator.lib.operation.multiply;
import com.mangusbrother.akka.calculator.lib.operation.MathematicalResult;
import lombok.Data;
/**
* Created by Mangusbrother on 14/02/2016.
*/
@Data
public class MultiplyResult implements MathematicalResult {
private static final long serialVersionUID = 738641818941986L;
private final int firstNumber;
private final int secondNumber;
private final int result;
}
Run Code Online (Sandbox Code Playgroud)
第二个错误是当一个类试图从lombok类访问getter时
我的maven pom.xml包含以下内容:
<properties>
<lombok.version>1.16.6</lombok.version>
</properties>
<dependencies>
<dependency>
<groupId>org.projectlombok</groupId>
<artifactId>lombok</artifactId>
<version>${lombok.version}</version>
</dependency>
</dependencies>
<build>
<plugins>
<plugin>
<groupId>org.apache.maven.plugins</groupId>
<artifactId>maven-compiler-plugin</artifactId>
<version>2.3.2</version>
<configuration>
<source>1.8</source>
<target>1.8</target>
</configuration>
</plugin>
</plugins>
</build>
Run Code Online (Sandbox Code Playgroud)
Ren*_*cia 21
<plugin>
<groupId>org.apache.maven.plugins</groupId>
<artifactId>maven-compiler-plugin</artifactId>
<version>${maven-compiler-plugin.version}</version>
<configuration>
<annotationProcessorPaths>
**<path>
<groupId>org.projectlombok</groupId>
<artifactId>lombok</artifactId>
<version>${lombok.version}</version>
</path>**
</annotationProcessorPaths>
</configuration>
Run Code Online (Sandbox Code Playgroud)
小智 9
我不知道为什么但是由于maven-compiler-plugin你得到了编译器错误.如果可以,请将插件版本更改为3.5并检查它是否可行.
小智 8
我的工作配置如下。
在 pom 文件中:
<properties>
<java.version>14</java.version>
<lombok-version>1.18.12</lombok-version>
</properties>
<dependency>
<groupId>org.projectlombok</groupId>
<artifactId>lombok</artifactId>
<version>${lombok-version}</version>
<optional>true</optional>
</dependency>
<build>
<plugins>
<plugin>
<groupId>org.apache.maven.plugins</groupId>
<artifactId>maven-compiler-plugin</artifactId>
<version>3.8.1</version>
<configuration>
<source>14</source>
<target>14</target>
<annotationProcessorPaths>
<path>
<groupId>org.projectlombok</groupId>
<artifactId>lombok</artifactId>
<version>${lombok-version}</version>
</path>
</annotationProcessorPaths>
</configuration>
</plugin>
</plugins>
</build>
Run Code Online (Sandbox Code Playgroud)
Maven 编译器插件版本 3.8.1 在这里很重要,因为旧版本不适合我。
在模块-info.java中
requires static lombok;
Run Code Online (Sandbox Code Playgroud)
小智 6
我为此苦苦挣扎并得出结论,Lombok 1.16+和Java 8是早期版本的 Maven 编译器插件的问题。IDEA 2017.1 正在构建没有错误的代码,但 Maven 在公共方法上抛出“找不到符号”错误,这些错误肯定存在于反编译的 jar 文件中。
通过在我的项目及其库中升级到maven-compiler-plugin 3.6.1,我能够解决它,而不必走我真正想避免的 Delombok 路径。