Octave 3.8.0 - Mac OS X中的软件包安装错误

6 macos octave package

我试图在Octave中安装一些软件包,但是我遇到了错误.任何帮助都感激不尽.我从Octave主目录尝试了这个.(我也尝试过:pkg install general-1.3.4.tar.gz)

octave:1> pkg install -forge general
In file included from /usr/local/octave/3.8.0/lib/gcc47/gcc/x86_64-apple-darwin13/4.7.3/include/stdint.h:3:0,
             from /usr/local/octave/3.8.0/include/octave-3.8.0/octave/oct-conf-post.h:167,
             from /usr/local/octave/3.8.0/include/octave-3.8.0/octave/config.h:3351,
             from /usr/local/octave/3.8.0/include/octave-3.8.0/octave/../octave/oct.h:31,
             from SHA1.cc:19:
/usr/local/octave/3.8.0/lib/gcc47/gcc/x86_64-apple-darwin13/4.7.3/include-fixed/stdint.h:27:32: fatal error: sys/_types/_int8_t.h: No such file or directory
compilation terminated.
make: *** [SHA1.oct] Error 1
/usr/local/octave/3.8.0/bin/mkoctfile-3.8.0 SHA1.cc

pkg: error running `make' for the general package.
error: called from 'configure_make' in file /usr/local/octave/3.8.0/share/octave/3.8.0/m/pkg/private/configure_make.m near line 82, column 9
error: called from:
error:   /usr/local/octave/3.8.0/share/octave/3.8.0/m/pkg/private/install.m at line 199, column 5
error:   /usr/local/octave/3.8.0/share/octave/3.8.0/m/pkg/pkg.m at line 394, column 9 
Run Code Online (Sandbox Code Playgroud)

小智 3

在新的终端窗口上运行以下命令在命令行和基于 gui 的版本上为我解决了这个问题:

xcode-选择--安装