Jus*_*oIt 5 python macos matplotlib theano
我正在尝试复制pyLearn2文档中的教程示例.当我运行时python make_dataset.py,在示例中,我收到此错误:
11:17 $ python make_dataset.py
/Users/user/pylearn2/pylearn2/utils/image.py:16: UserWarning: Unable to import matplotlib. Some features unavailable. Original exception: dlopen(/Library/Python/2.7/site-packages/matplotlib-1.4.x-py2.7-macosx-10.9-intel.egg/matplotlib/backends/_macosx.so, 2): Symbol not found: __cg_jpeg_resync_to_restart
Run Code Online (Sandbox Code Playgroud)
参考自:/System/Library/Frameworks/ImageIO.framework/Versions/A/ImageIO
期望: /usr/local/lib/libjpeg.8.dylib
我可以matplotlib在命令行中导入和映像python.有人可以帮助我理解它抱怨什么以及如何解决错误?
另一个问题(可能与上述问题有关,也可能与之无关)是链接错误
使用以下命令行编译期间出现问题:
g++ -dynamiclib -g -O3 -fno-math-errno -Wno-unused-label -Wno-unused-variable -Wno-write-strings -march=core-avx-i -mmmx -mno-3dnow -msse -msse2 -msse3 -mssse3 -mno-sse4a -mcx16 -msahf -mno-movbe -maes -mpclmul -mpopcnt -mno-abm -mno-lwp -mno-fma -mno-fma4 -mno-xop -mno-bmi -mno-bmi2 -mno-tbm -mavx -mno-avx2 -msse4.2 -msse4.1 -mno-lzcnt -mno-rtm -mno-hle -mrdrnd -mf16c -mfsgsbase -mno-rdseed -mno-prfchw -mno-adx -mfxsr -mxsave -mxsaveopt -mno-avx512f -mno-avx512er -mno-avx512cd -mno-avx512pf --param l1-cache-size=32 --param l1-cache-line-size=64 --param l2-cache-size=6144 -mtune=core-avx-i -D NPY_NO_DEPRECATED_API=NPY_1_7_API_VERSION -m64 -fPIC -undefined dynamic_lookup -I/Library/Python/2.7/site-packages/numpy-1.9.0.dev_297f54b-py2.7-macosx-10.9-intel.egg/numpy/core/include -I/System/Library/Frameworks/Python.framework/Versions/2.7/include/python2.7 -o /Users/user/.theano/compiledir_Darwin-13.2.0-x86_64-i386-64bit-i386-2.7.5-64/tmpBdy9w9/49d70155ef39a124cbfa83c600416644.so /Users/user/.theano/compiledir_Darwin-13.2.0-x86_64-i386-64bit-i386-2.7.5-64/tmpBdy9w9/mod.cpp -L/System/Library/Frameworks/Python.framework/Versions/2.7/lib
ld: library not found for -lgcc_ext.10.5
collect2: error: ld returned 1 exit status
Exception: ('The following error happened while compiling the node', InplaceDimShuffle{x,0}(mean), '\n', 'Compilation failed (return status=1): ld: library not found for -lgcc_ext.10.5. collect2: error: ld returned 1 exit status. ', '[InplaceDimShuffle{x,0}(mean)]')
Run Code Online (Sandbox Code Playgroud)
我pyLearn2在Mac OSX Mavericks上运行.我不确定如何修复错误:库似乎在我的系统中的几个地方:
/usr/local/Cellar/gcc47/4.7.3/lib/gcc/x86_64-apple-darwin13.0.0/4.7.3/libgcc_ext.10.5.dylib
/usr/local/Cellar/gfortran/4.8.2/gfortran/lib/libgcc_ext.10.5.dylib
/usr/local/lib/gcc/x86_64-apple-darwin13.0.0/4.7.3/libgcc_ext.10.5.dylib
Run Code Online (Sandbox Code Playgroud)
我不确定要链接哪一个以及我应该如何链接.
我已经更改(添加)了DYLD_LIBRARY_PATH没有解决问题的路径.
任何帮助将不胜感激.
小智 0
看起来一种可能的解决方案是手动创建 .dylib 文件的链接:
sudo ln -sf /System/Library/Frameworks/OpenGL.framework/Versions/A/Libraries/libGL.dylib /opt/local/lib/libGL.dylib
sudo ln -sf /System/Library/Frameworks/ApplicationServices.framework/Versions/A/Frameworks/ImageIO.framework/Versions/A/Resources/libPng.dylib /opt/local/lib/libpng.dylib
sudo ln -sf /System/Library/Frameworks/ApplicationServices.framework/Versions/A/Frameworks/ImageIO.framework/Versions/A/Resources/libTIFF.dylib /opt/local/lib/libtiff.dylib
sudo ln -sf /System/Library/Frameworks/ApplicationServices.framework/Versions/A/Frameworks/ImageIO.framework/Versions/A/Resources/libJPEG.dylib /opt/local/lib/libjpeg.dylib
为什么这有效?因为无论出于何种原因,当Apple请求libJPEG.dyld时,无论系统搜索它都会找到/opt/local/lib/libjpeg.dyld,因为搜索不区分大小写。对于 Unix 操作系统。去搞清楚。上面的行将强制任何寻找 libjpeg.dyld 的程序重定向到 Apple 的 libJPEG.dyld。
另一位用户建议设置 DYLD_FALLBACK_LIBRARY_PATH:
您还可以使用 DYLD_FALLBACK_LIBRARY_PATH。我必须使用它来避免 Apple 的 libJPEG 妨碍需要 libjpeg 端口的应用程序。有关详细信息,请参阅 dlopen() 的手册页。
| 归档时间: |
|
| 查看次数: |
582 次 |
| 最近记录: |