相关疑难解决方法(0)

如何安装`帽子`

我试图获得Hat调试器.当我尝试:

cabal install hat 要么 cabal install hat -v

最后我得到:

configure: error: in `/tmp/terminfo-0.4.0.0-17745/terminfo-0.4.0.0':
configure: error: curses headers could not be found, so this package cannot be built
See `config.log' for more details
Failed to install terminfo-0.4.0.0
cabal: Error: some packages failed to install:
haskeline-0.7.1.3 depends on terminfo-0.4.0.0 which failed to install.
hat-2.8.0.0 depends on terminfo-0.4.0.0 which failed to install.
terminfo-0.4.0.0 failed during the configure step. The exception was:
ExitFailure 1
Run Code Online (Sandbox Code Playgroud)

所以麻烦我尝试:

cabal install terminfo
Run Code Online (Sandbox Code Playgroud)

得到:

configure: error: …
Run Code Online (Sandbox Code Playgroud)

debugging haskell hat cabal cabal-install

2
推荐指数
1
解决办法
709
查看次数

标签 统计

cabal ×1

cabal-install ×1

debugging ×1

haskell ×1

hat ×1