找不到针对grpc@1.10.1和node@10.9.0的预构建二进制文件

Alp*_*eta 5 node.js npm firebase

尝试在项目中安装node_modules时,出现大量错误消息。我以前已经成功安装了它,但是我不确定我做错了什么导致现在生成所有这些错误消息。

任何有助于理解其含义的帮助都将是巨大的。在此之前,我做了以下grpc安装,安装了v1.14.1:

$ npm install -g grpc@latest

grpc@1.14.1 install /usr/local/lib/node_modules/grpc
node-pre-gyp install --fallback-to-build --library=static_library

node-pre-gyp WARN Using needle for node-pre-gyp https download 
[grpc] Success: "/usr/local/lib/node_modules/grpc/src/node/extension_binary/node-v64-darwin-x64-unknown/grpc_node.node" is installed via remote
+ grpc@1.14.1
added 85 packages from 48 contributors in 6.344s
Run Code Online (Sandbox Code Playgroud)

所以很好奇节点为什么要在以下消息中使用v1.10.1:

$ npm i

> fsevents@1.2.4 install /path/to/app/node_modules/fsevents
> node install

[fsevents] Success: "/path/to/app/node_modules/fsevents/lib/binding/Release/node-v64-darwin-x64/fse.node" already installed
Pass --update-binary to reinstall or --build-from-source to recompile

> grpc@1.10.1 install /path/to/app/node_modules/@firebase/firestore/node_modules/grpc
> node-pre-gyp install --fallback-to-build --library=static_library

node-pre-gyp ERR! Tried to download(403): https://storage.googleapis.com/grpc-precompiled-binaries/node/grpc/v1.10.1/node-v64-darwin-x64-unknown.tar.gz 
node-pre-gyp ERR! Pre-built binaries not found for grpc@1.10.1 and node@10.9.0 (node-v64 ABI, unknown) (falling back to source compile with node-gyp) 
node-pre-gyp ERR! Pre-built binaries not installable for grpc@1.10.1 and node@10.9.0 (node-v64 ABI, unknown) (falling back to source compile with node-gyp) 
node-pre-gyp ERR! Hit error Connection closed while downloading tarball file 
  CXX(target) Release/obj.target/grpc/deps/grpc/src/core/lib/surface/init.o
  CXX(target) Release/obj.target/grpc/deps/grpc/src/core/lib/surface/init.o
sed: ./Release/.deps/Release/obj.target/grpc/deps/grpc/src/core/lib/surface/init.o.d.raw: No such file or directory
  CXX(target) Release/obj.target/grpc/deps/grpc/src/core/lib/avl/avl.o
rm: ./Release/.deps/Release/obj.target/grpc/deps/grpc/src/core/lib/surface/init.o.d.raw: No such file or directory
make: *** [Release/obj.target/grpc/deps/grpc/src/core/lib/surface/init.o] Error 1
gyp ERR! build error 
gyp ERR! stack Error: `make` failed with exit code: 2
gyp ERR! stack     at ChildProcess.onExit (/usr/local/lib/node_modules/npm/node_modules/node-gyp/lib/build.js:262:23)
gyp ERR! stack     at ChildProcess.emit (events.js:182:13)
gyp ERR! stack     at Process.ChildProcess._handle.onexit (internal/child_process.js:239:12)
gyp ERR! System Darwin 17.7.0
gyp ERR! command "/usr/local/Cellar/node/10.9.0/bin/node" "/usr/local/lib/node_modules/npm/node_modules/node-gyp/bin/node-gyp.js" "build" "--fallback-to-build" "--library=static_library" "--module=/path/to/app/node_modules/@firebase/firestore/node_modules/grpc/src/node/extension_binary/node-v64-darwin-x64-unknown/grpc_node.node" "--module_name=grpc_node" "--module_path=/path/to/app/node_modules/@firebase/firestore/node_modules/grpc/src/node/extension_binary/node-v64-darwin-x64-unknown"
gyp ERR! cwd /path/to/app/node_modules/@firebase/firestore/node_modules/grpc
gyp ERR! node -v v10.9.0
gyp ERR! node-gyp -v v3.7.0
gyp ERR! not ok 
node-pre-gyp ERR! build error 
node-pre-gyp ERR! stack Error: Failed to execute '/usr/local/Cellar/node/10.9.0/bin/node /usr/local/lib/node_modules/npm/node_modules/node-gyp/bin/node-gyp.js build --fallback-to-build --library=static_library --module=/path/to/app/node_modules/@firebase/firestore/node_modules/grpc/src/node/extension_binary/node-v64-darwin-x64-unknown/grpc_node.node --module_name=grpc_node --module_path=/path/to/app/node_modules/@firebase/firestore/node_modules/grpc/src/node/extension_binary/node-v64-darwin-x64-unknown' (1)
node-pre-gyp ERR! stack     at ChildProcess.<anonymous> (/path/to/app/node_modules/@firebase/firestore/node_modules/grpc/node_modules/node-pre-gyp/lib/util/compile.js:83:29)
node-pre-gyp ERR! stack     at ChildProcess.emit (events.js:182:13)
node-pre-gyp ERR! stack     at maybeClose (internal/child_process.js:961:16)
node-pre-gyp ERR! stack     at Process.ChildProcess._handle.onexit (internal/child_process.js:250:5)
node-pre-gyp ERR! System Darwin 17.7.0
node-pre-gyp ERR! command "/usr/local/Cellar/node/10.9.0/bin/node" "/path/to/app/node_modules/@firebase/firestore/node_modules/grpc/node_modules/.bin/node-pre-gyp" "install" "--fallback-to-build" "--library=static_library"
node-pre-gyp ERR! cwd /path/to/app/node_modules/@firebase/firestore/node_modules/grpc
node-pre-gyp ERR! node -v v10.9.0
node-pre-gyp ERR! node-pre-gyp -v v0.7.0
node-pre-gyp ERR! not ok 
Failed to execute '/usr/local/Cellar/node/10.9.0/bin/node /usr/local/lib/node_modules/npm/node_modules/node-gyp/bin/node-gyp.js build --fallback-to-build --library=static_library --module=/path/to/app/node_modules/@firebase/firestore/node_modules/grpc/src/node/extension_binary/node-v64-darwin-x64-unknown/grpc_node.node --module_name=grpc_node --module_path=/path/to/app/node_modules/@firebase/firestore/node_modules/grpc/src/node/extension_binary/node-v64-darwin-x64-unknown' (1)
  CXX(target) Release/obj.target/grpc/deps/grpc/src/core/lib/backoff/backoff.oexec install script
  CXX(target) Release/obj.target/grpc/deps/grpc/src/core/lib/channel/channel_args.oinstall script
error: error reading '../deps/grpc/src/core/lib/channel/channel_args.cc'
1 error generated.
make: *** [Release/obj.target/grpc/deps/grpc/src/core/lib/channel/channel_args.o] Error 1
gyp ERR! build error 
gyp ERR! stack Error: `make` failed with exit code: 2
gyp ERR! stack     at ChildProcess.onExit (/usr/local/lib/node_modules/npm/node_modules/node-gyp/lib/build.js:262:23)
gyp ERR! stack     at ChildProcess.emit (events.js:182:13)
gyp ERR! stack     at Process.ChildProcess._handle.onexit (internal/child_process.js:239:12)
gyp ERR! System Darwin 17.7.0l: info lifecycle grpc@1.10.1~install: Failed to exec install script
gyp ERR! command "/usr/local/Cellar/node/10.9.0/bin/node" "/usr/local/lib/node_modules/npm/node_modules/node-gyp/bin/node-gyp.js" "build" "--fallback-to-build" "--library=static_library" "--module=/path/to/app/node_modules/@firebase/firestore/node_modules/grpc/src/node/extension_binary/node-v64-darwin-x64-unknown/grpc_node.node" "--module_name=grpc_node" "--module_path=/path/to/app/node_modules/@firebase/firestore/node_modules/grpc/src/node/extension_binary/node-v64-darwin-x64-unknown"
gyp ERR! cwd /path/to/app/node_modules/@firebase/firestore/node_modules/grpc
gyp ERR! node -v v10.9.0
gyp ERR! node-gyp -v v3.7.0
gyp ERR! not ok 
npm ERR! code ELIFECYCLE
npm ERR! errno 1
npm ERR! grpc@1.10.1 install: `node-pre-gyp install --fallback-to-build --library=static_library`
npm ERR! Exit status 1
npm ERR! 
npm ERR! Failed at the grpc@1.10.1 install script.
npm ERR! This is probably not a problem with npm. There is likely additional logging output above.

npm ERR! A complete log of this run can be found in:
npm ERR!     /Users/myfolder/.npm/_logs/2018-09-03T16_54_49_177Z-debug.log
Run Code Online (Sandbox Code Playgroud)

Alp*_*eta 11

找到了一段时间,但是对我有用的解决方案是:

  1. 删除node_modules / grpc文件夹
  2. 删除项目根文件夹中的package-lock.json文件
  3. npm重建节点ass

ionic服务和构建命令现在可用于ios。

编辑(2018-09-07):

尽管上述步骤暂时起作用,但grpc 1.10.1问题稍后又出现了。经过更多调查并感谢@ murgatroid99的提示,我发现问题是由firebase插件中旧版本的firestore引起的,该版本在package.json中引用了grpc v1.10.1。

在我使用以下方法将firebase更新到最新版本后:

npm i firebase@latest
Run Code Online (Sandbox Code Playgroud)

使用v1.13.1进行报告,问题就消失了。

希望对任何有相同问题的人有所帮助。

  • 我遇到了同样的错误,卸载了 firebase 并安装了最新版本,解决了问题。 (3认同)

Mr.*_*ear 5

您的节点版本是什么?您可以通过“ node -v”来检查它,我的版本是v10.9.0,我遇到了这个错误,但是当我降级到v8.11.4并从该网站“ https://nodejs.org/en/ ” 下载并进行了npm更新时- 有用。


mur*_*d99 5

这里的问题是gRPC 1.10有点旧,并且不支持Node10。您可以通过使用更高版本的gRPC或旧版本的Node来解决此问题。

问题中的错误消息表明,安装gRPC作为的依赖项时会发生故障@firebase/firestore。您可能需要升级对该软件包的依赖性,以获得更高版本的gRPC。